�s����,�v,�j,��,����_�v,����_�j,����_��,������_�v,������_�j,������_��,����_�v,����_�j,����_��,�劲�ۈ狳�@_�v,�劲�ۈ狳�@_�j,�劲�ۈ狳�@_��,�劲�w�����@_�v,�劲�w�����@_�j,�劲�w�����@_��,�ۈ狳�@_�v,�ۈ狳�@_�j,�ۈ狳�@_��,���ۈ狳�@_�v,���ۈ狳�@_�j,���ۈ狳�@_��,�劲�{�싳�@_�v,�劲�{�싳�@_�j,�劲�{�싳�@_��,�{�싳�@_�v,�{�싳�@_�j,�{�싳�@_��,�{�쏕���@_�v,�{�쏕���@_�j,�{�쏕���@_��,�劲�h�{���@_�v,�劲�h�{���@_�j,�劲�h�{���@_��,�h�{���@_�v,�h�{���@_�j,�h�{���@_��,�u�t_�v,�u�t_�j,�u�t_��,���@��_�v,���@��_�j,���@��_��,�ۈ�m_�v,�ۈ�m_�j,�ۈ�m_��,����E�ۈ�⏕��_�v,����E�ۈ�⏕��_�j,����E�ۈ�⏕��_��
205 �ѓc�s,79,6,73,6,2,4,1,,1,,,,6,,6,1,,1,64,4,60,,,,,,,,,,,,,,,,1,,1,,,,1,,1,3,,3,1,,1
209 �ɓߎs,21,4,17,2,2,,,,,,,,,,,4,1,3,14,1,13,,,,,,,,,,,,,,,,1,,1,,,,,,,,,,,,
210 ����s,,,,,,,,,,,,,,,,,,,,,,,,,,,,,,,,,,,,,,,,,,,,,,,,,,,
382 �C�쒬,,,,,,,,,,,,,,,,,,,,,,,,,,,,,,,,,,,,,,,,,,,,,,,,,,,
383 ���֒�,,,,,,,,,,,,,,,,,,,,,,,,,,,,,,,,,,,,,,,,,,,,,,,,,,,
384 �ѓ���,,,,,,,,,,,,,,,,,,,,,,,,,,,,,,,,,,,,,,,,,,,,,,,,,,,
385 �얥�֑�,,,,,,,,,,,,,,,,,,,,,,,,,,,,,,,,,,,,,,,,,,,,,,,,,,,
386 ���쑺,,,,,,,,,,,,,,,,,,,,,,,,,,,,,,,,,,,,,,,,,,,,,,,,,,,
388 �{�c��,,,,,,,,,,,,,,,,,,,,,,,,,,,,,,,,,,,,,,,,,,,,,,,,,,,
402 ���쒬,,,,,,,,,,,,,,,,,,,,,,,,,,,,,,,,,,,,,,,,,,,,,,,,,,,
403 ���X��,,,,,,,,,,,,,,,,,,,,,,,,,,,,,,,,,,,,,,,,,,,,,,,,,,,
404 ���쒬,,,,,,,,,,,,,,,,,,,,,,,,,,,,,,,,,,,,,,,,,,,,,,,,,,,
407 ���q��,,,,,,,,,,,,,,,,,,,,,,,,,,,,,,,,,,,,,,,,,,,,,,,,,,,
409 ���J��,,,,,,,,,,,,,,,,,,,,,,,,,,,,,,,,,,,,,,,,,,,,,,,,,,,
410 ���H��,,,,,,,,,,,,,,,,,,,,,,,,,,,,,,,,,,,,,,,,,,,,,,,,,,,
411 ������,,,,,,,,,,,,,,,,,,,,,,,,,,,,,,,,,,,,,,,,,,,,,,,,,,,
412 ���ؑ�,,,,,,,,,,,,,,,,,,,,,,,,,,,,,,,,,,,,,,,,,,,,,,,,,,,
413 �V����,,,,,,,,,,,,,,,,,,,,,,,,,,,,,,,,,,,,,,,,,,,,,,,,,,,
414 �ו���,,,,,,,,,,,,,,,,,,,,,,,,,,,,,,,,,,,,,,,,,,,,,,,,,,,
415 ���ؑ�,,,,,,,,,,,,,,,,,,,,,,,,,,,,,,,,,,,,,,,,,,,,,,,,,,,
416 �L�u��,,,,,,,,,,,,,,,,,,,,,,,,,,,,,,,,,,,,,,,,,,,,,,,,,,,
417 �厭��,,,,,,,,,,,,,,,,,,,,,,,,,,,,,,,,,,,,,,,,,,,,,,,,,,,
131 �l���s����,220,11,209,8,4,4,4,1,3,1,,1,14,,14,,,,169,6,163,3,,3,,,,,,,,,,,,,4,,4,17,,17,,,,,,,,,
132 �l���s����,182,8,174,7,1,6,4,,4,,,,9,1,8,1,,1,159,6,153,1,,1,,,,,,,,,,,,,1,,1,,,,,,,1,,1,3,,3
133 �l���s����,142,6,136,6,3,3,2,,2,1,,1,10,,10,2,,2,116,2,114,1,1,,,,,,,,,,,,,,4,,4,,,,,,,,,,1,,1
134 �l���s���,241,12,229,9,3,6,5,1,4,2,,2,16,1,15,3,1,2,185,6,179,,,,,,,1,,1,,,,,,,6,,6,14,,14,,,,,,,8,1,7
135 �l���s�k��,118,12,106,4,1,3,2,,2,,,,5,1,4,,,,104,10,94,3,,3,,,,,,,,,,,,,,,,,,,,,,1,,1,2,,2
136 �l���s�l�k��,214,16,198,8,,8,7,2,5,,,,15,3,12,,,,180,11,169,2,,2,,,,,,,,,,,,,2,,2,,,,,,,,,,4,,4
137 �l���s�V����,50,1,49,2,,2,2,,2,,,,4,,4,,,,42,1,41,,,,,,,,,,,,,,,,,,,,,,,,,,,,1,,1
211 �֓c�s,56,4,52,2,1,1,,,,1,1,,1,,1,,,,52,2,50,,,,,,,,,,,,,,,,,,,,,,,,,,,,2,,2
213 �|��s,109,4,105,4,2,2,4,,4,,,,7,,7,,,,92,2,90,,,,,,,1,,1,,,,,,,1,,1,,,,,,,,,,2,,2
216 �܈�s,20,2,18,,,,1,,1,,,,1,,1,2,,2,16,2,14,,,,,,,,,,,,,,,,,,,,,,,,,,,,,,
221 �ΐ��s,23,,23,1,,1,1,,1,1,,1,2,,2,3,,3,15,,15,,,,,,,,,,,,,,,,,,,,,,,,,,,,,,
223 ��O��s,,,,,,,,,,,,,,,,,,,,,,,,,,,,,,,,,,,,,,,,,,,,,,,,,,,
224 �e��s,,,,,,,,,,,,,,,,,,,,,,,,,,,,,,,,,,,,,,,,,,,,,,,,,,,
226 �q�V���s,32,2,30,2,2,,2,,2,,,,3,,3,,,,25,,25,,,,,,,,,,,,,,,,,,,,,,,,,,,,,,
461 �X��,,,,,,,,,,,,,,,,,,,,,,,,,,,,,,,,,,,,,,,,,,,,,,,,,,,
201 �L���s,344,17,327,13,7,6,10,4,6,,,,14,,14,25,2,23,274,4,270,8,,8,,,,,,,,,,,,,,,,,,,,,,12,,12,2,,2
207 �L��s,,,,,,,,,,,,,,,,,,,,,,,,,,,,,,,,,,,,,,,,,,,,,,,,,,,
214 ���S�s,21,1,20,1,,1,1,,1,,,,1,,1,,,,18,1,17,,,,,,,,,,,,,,,,,,,,,,,,,,,,,,
221 �V��s,,,,,,,,,,,,,,,,,,,,,,,,,,,,,,,,,,,,,,,,,,,,,,,,,,,
231 �c���s,42,4,38,2,2,,,,,1,,1,3,1,2,3,,3,33,1,32,,,,,,,,,,,,,,,,,,,,,,,,,,,,,,
561 �݊y��,,,,,,,,,,,,,,,,,,,,,,,,,,,,,,,,,,,,,,,,,,,,,,,,,,,
562 ���h��,,,,,,,,,,,,,,,,,,,,,,,,,,,,,,,,,,,,,,,,,,,,,,,,,,,
563 �L����,,,,,,,,,,,,,,,,,,,,,,,,,,,,,,,,,,,,,,,,,,,,,,,,,,,
